Target
Neuronal acetylcholine receptor subunit alpha-7
Ligand
BDBM50436919
Substrate
Meas. Tech.
ChEMBL_972034 (CHEMBL2405985)
IC50
41000±n/a nM
Citation
 Chojnacka, KPapke, RLHorenstein, NA Synthesis and evaluation of a conditionally-silent agonist for thea7 nicotinic acetylcholine receptor. Bioorg Med Chem Lett 23:4145-9 (2013)  
Target
Name:
Neuronal acetylcholine receptor subunit alpha-7
Synonyms:
ACHA7_HUMAN Cholinergic, Nicotinic Alpha7 Neuronal acetylcholine receptor protein alpha-7 subunit Nicotinic acetylcholine receptor alpha-7 (alpha7 nAChR)
Type:
Mol. Mass.:
56448.33
Organism:
Homo sapiens (Human)
Description:
CHRNA7 (NACHRA7)
Residue:
502
  
Inhibitor
Name:
BDBM50436919
Synonyms:
CHEMBL2402006
Type:
Small organic molecule
Emp. Form.:
C16H16N2
Mol. Mass.:
236.3116
SMILES:
C1CCC(=NC1)c1cncc(c1)-c1ccccc1
: