Target
Serine/threonine-protein kinase PAK 1
Ligand
BDBM50437026
Substrate
Meas. Tech.
ChEMBL_971749 (CHEMBL2404585)
IC50
98±n/a nM
Citation
 Xu, YFoulks, JMClifford, ABrenning, BLai, SLuo, BParnell, KMMerx, SMcCullar, MVKanner, SBHo, KK Synthesis and structure-activity relationship of 2-arylamino-4-aryl-pyrimidines as potent PAK1 inhibitors. Bioorg Med Chem Lett 23:4072-5 (2013)  
Target
Name:
Serine/threonine-protein kinase PAK 1
Synonyms:
2.7.11.1 Cell division control protein 42 homolog PAK-1 PAK1_HUMAN p21-activated kinase 1 | p65-PAK
Type:
Mol. Mass.:
60640.15
Organism:
Homo sapiens (Human)
Description:
Q13153
Residue:
545
  
Inhibitor
Name:
BDBM50437026
Synonyms:
CHEMBL2403056
Type:
Small organic molecule
Emp. Form.:
C24H24ClFN6O
Mol. Mass.:
466.938
SMILES:
COc1cc(Nc2ncc(Cl)c(n2)-c2cc(F)cc(CC#N)c2)ccc1N1CCN(C)CC1
: