Target
Proto-oncogene tyrosine-protein kinase Src
Ligand
BDBM25118
Substrate
Meas. Tech.
ChEMBL_970148 (CHEMBL2406233)
IC50
81±n/a nM
Citation
 Richters, AKetzer, JGetlik, MGrütter, CSchneider, RHeuckmann, JMHeynck, SSos, MLGupta, AUnger, ASchultz-Fademrecht, CThomas, RKBauer, SRauh, D Targeting gain of function and resistance mutations in Abl and KIT by hybrid compound design. J Med Chem 56:5757-72 (2014)  
Target
Name:
Proto-oncogene tyrosine-protein kinase Src
Synonyms:
Proto-oncogene c-Src SRC_CHICK c-Src p60c-src | pp60c-src
Type:
Tyr protein kinase
Mol. Mass.:
60015.36
Organism:
Gallus gallus (Chicken)
Description:
P00523
Residue:
533
  
Inhibitor
Name:
BDBM25118
Synonyms:
(3Z)-4-amino-5-fluoro-3-[5-(4-methylpiperazino)-1,3-dihydrobenzimidazol-2-ylidene]carbostyril CHEMBL522892 | CHIR-258
Type:
Small organic molecule
Emp. Form.:
C21H21FN6O
Mol. Mass.:
392.4294
SMILES:
CN1CCN(CC1)c1ccc2nc([nH]c2c1)-c1c(N)c2c(F)cccc2[nH]c1=O
: