Target
11-beta-hydroxysteroid dehydrogenase 1
Ligand
BDBM50067028
Substrate
Meas. Tech.
ChEMBL_969405 (CHEMBL2405595)
IC50
257±n/a nM
Citation
 Lin, HHu, GXGuo, JGe, YLiang, GLian, QQChu, YYuan, XHuang, PGe, RS Mono-carbonyl curcumin analogues as 11ß-hydroxysteroid dehydrogenase 1 inhibitors. Bioorg Med Chem Lett 23:4362-6 (2013)  
Target
Name:
11-beta-hydroxysteroid dehydrogenase 1
Synonyms:
11-DH 11-beta-Hydroxysteroid Dehydrogenase 1 (11-beta-HSD1) 11-beta-hydroxysteroid dehydrogenase 1 (11HSD1) Corticosteroid 11-beta-dehydrogenase isozyme 1 (11-beta-HSD-1) Corticosteroid 11-beta-dehydrogenase isozyme 1 (11beta-HSD1) HSD11 HSD11L | SDR26C1
Type:
Enzyme
Mol. Mass.:
32409.16
Organism:
Homo sapiens (Human)
Description:
P28845
Residue:
292
  
Inhibitor
Name:
BDBM50067028
Synonyms:
(1E,4E)-1,5-Bis-(4-hydroxy-3-methoxy-phenyl)-penta-1,4-dien-3-one 1,5-Bis(4-hydroxy-3-methoxyphenyl)penta-1,4-dien-3-one 1,5-bis-(4-hydroxy-3-methoxyphenyl)-penta-1,4-dien-3-one Go-Y022
Type:
Small organic molecule
Emp. Form.:
C19H18O5
Mol. Mass.:
326.3432
SMILES:
COc1cc(\C=C\C(=O)\C=C\c2ccc(O)c(OC)c2)ccc1O
: