Target
Myoglobin
Ligand
BDBM50437331
Substrate
Meas. Tech.
ChEMBL_972224 (CHEMBL2411426)
IC50
2300±n/a nM
Citation
 Shchepin, RVLiu, WYin, HZagol-Ikapitte, IAmin, TJeong, BSRoberts, LJOates, JAPorter, NABoutaud, O Rational Design of Novel Pyridinol-Fused Ring Acetaminophen Analogues. ACS Med Chem Lett 4:710-714 (2013)  
Target
Name:
Myoglobin
Synonyms:
MB | MYG_HUMAN
Type:
PROTEIN
Mol. Mass.:
17188.13
Organism:
Homo sapiens (Human)
Description:
ChEMBL_107627
Residue:
154
  
Inhibitor
Name:
BDBM50437331
Synonyms:
CHEMBL2407811
Type:
Small organic molecule
Emp. Form.:
C9H11N3O2
Mol. Mass.:
193.2025
SMILES:
Cc1nc2NC(=O)NCc2c(C)c1O
: