Target
Myoglobin
Ligand
BDBM50437332
Substrate
Meas. Tech.
ChEMBL_972224 (CHEMBL2411426)
IC50
1200±n/a nM
Citation
 Shchepin, RVLiu, WYin, HZagol-Ikapitte, IAmin, TJeong, BSRoberts, LJOates, JAPorter, NABoutaud, O Rational Design of Novel Pyridinol-Fused Ring Acetaminophen Analogues. ACS Med Chem Lett 4:710-714 (2013)  
Target
Name:
Myoglobin
Synonyms:
MB | MYG_HUMAN
Type:
PROTEIN
Mol. Mass.:
17188.13
Organism:
Homo sapiens (Human)
Description:
ChEMBL_107627
Residue:
154
  
Inhibitor
Name:
BDBM50437332
Synonyms:
CHEMBL2407813
Type:
Small organic molecule
Emp. Form.:
C7H7N3O2
Mol. Mass.:
165.1494
SMILES:
Oc1cnc2NC(=O)NCc2c1
: