Target
NF-kappa-B inhibitor alpha
Ligand
BDBM50437352
Substrate
Meas. Tech.
ChEMBL_972404 (CHEMBL2412579)
IC50
26200±n/a nM
Citation
 Ozawa, MMorita, MHirai, GTamura, SKawai, MTsuchiya, AOonuma, KMaruoka, KSodeoka, M Contribution of Cage-Shaped Structure of Physalins to Their Mode of Action in Inhibition of NF-kB Activation ACS Med Chem Lett 4:730-5 (2013)  
Target
Name:
NF-kappa-B inhibitor alpha
Synonyms:
I-kappa-B-alpha IKBA_HUMAN NF-kappa-B inhibitor alpha NFKBIA
Type:
GST fusion protein
Mol. Mass.:
35584.84
Organism:
Homo sapiens (Human)
Description:
It was produced in E. coli as GST-tagged fusion protein (Santa Cruz Biotechnology).
Residue:
317
  
Inhibitor
Name:
BDBM50437352
Synonyms:
CHEMBL2408033
Type:
Small organic molecule
Emp. Form.:
C28H30O9
Mol. Mass.:
510.5324
SMILES:
C[C@@]12OC(=O)[C@@]3(O)CC[C@H]4[C@@H](CC=C5CC=CC(=O)[C@]45C)[C@@]4(O)O[C@@]13[C@@H](C4=O)[C@]1(C)C[C@H]2OC(=O)C1=C
: