Target
Integrin alpha-IIb/beta-3
Ligand
BDBM50354352
Substrate
Meas. Tech.
ChEMBL_974126 (CHEMBL2410849)
IC50
6.5±n/a nM
Citation
 Krysko, AASamoylenko, GVPolishchuk, PGFonari, MSKravtsov, VChAndronati, SAKabanova, TALipkowski, JKhristova, TMKuz'min, VEKabanov, VMKrysko, OLVarnek, AA Synthesis, biological evaluation, X-ray molecular structure and molecular docking studies of RGD mimetics containing 6-amino-2,3-dihydroisoindolin-1-one fragment as ligands of integrinaIIbß3. Bioorg Med Chem 21:4646-61 (2013)  
Target
Name:
Integrin alpha-IIb/beta-3
Synonyms:
Glycoprotein IIb/IIIa
Type:
Mol. Mass.:
Description:
ASSAY_ID of EBI is 30109
Components:
This complex has 2 components.
Component 1
Name:
Integrin beta-3
Synonyms:
CD_antigen=CD61 GPIIIa ITGB3 Platelet membrane glycoprotein IIIa
Type:
Protein
Mol. Mass.:
87038.91
Organism:
Homo sapiens (Human)
Description:
P05106
Residue:
788
  
Component 2
Name:
Integrin alpha-IIb
Synonyms:
CD_antigen=CD41 GPIIb Glycoprotein IIb ITGA2B Integrin alpha-IIb heavy chain Integrin alpha-IIb light chain, form 2 Integrin alpha-V/beta-3 and alpha-IIb/beta 3 | Platelet membrane glycoprotein IIb
Type:
Protein
Mol. Mass.:
113354.85
Organism:
Homo sapiens (Human)
Description:
P08514
Residue:
1039
  
Inhibitor
Name:
BDBM50354352
Synonyms:
CHEMBL1836347
Type:
Small organic molecule
Emp. Form.:
C21H21N3O4
Mol. Mass.:
379.4091
SMILES:
OC(=O)CCN1Cc2ccc(NC(=O)c3ccc4CCNCc4c3)cc2C1=O
: