Target
Cathepsin D
Ligand
BDBM50437542
Substrate
Meas. Tech.
ChEMBL_974167 (CHEMBL2411009)
IC50
2.0±n/a nM
Citation
 Pennington, LDWhittington, DABartberger, MDJordan, SRMonenschein, HNguyen, TTYang, BHXue, QMVounatsos, FWahl, RCChen, KWood, SCitron, MPatel, VFHitchcock, SAZhong, W Hydroxyethylamine-based inhibitors of BACE1: P1-P3 macrocyclization can improve potency, selectivity, and cell activity. Bioorg Med Chem Lett 23:4459-64 (2013)  
Target
Name:
Cathepsin D
Synonyms:
CATD_HUMAN CTSD Cathepsin D heavy chain Cathepsin D precursor
Type:
Enzyme
Mol. Mass.:
44551.72
Organism:
Homo sapiens (Human)
Description:
Human proCathepsin D (SwissProt accession number P07339) was expressed in Sf9 cells, purified, and autoactivated.
Residue:
412
  
Inhibitor
Name:
BDBM50437542
Synonyms:
CHEMBL2407492
Type:
Small organic molecule
Emp. Form.:
C35H44N4O4
Mol. Mass.:
584.7483
SMILES:
CC(C)(C)Cc1cnc2OC3(CCC3)C[C@H](NC[C@@H](O)[C@@H]3Cc4cccc(CCCn5cc(ccc5=O)C(=O)N3)c4)c2c1
: