Target
Integrin alpha-4/beta-7
Ligand
BDBM50437656
Substrate
Meas. Tech.
ChEMBL_974258 (CHEMBL2411536)
IC50
594±n/a nM
Citation
 Xu, YZSmith, JLSemko, CMRossiter, KIFukuda, JYDappen, MSQuincy, DAKonradi, AWMao, WWelch, BDreyer, MLSamant, BZhang, HLugar, JLiao, ZHenschel, CPetersen, EVandevert, CShoemaker, MWehner, NMutter, LShopp, GKrimm, MChen, LWipke, BDofiles, LGallager, ISauer, JMMessersmith, EKPleiss, MABard, FYednock, TA Orally available and efficaciousa4ß1/a4ß7 integrin inhibitors. Bioorg Med Chem Lett 23:4370-3 (2013)  
Target
Name:
Integrin alpha-4/beta-7
Synonyms:
Integrin α4β7 Integrin alpha-4/beta7 | Integrin alpha4beta7
Type:
Protein Complex
Mol. Mass.:
Description:
The assay uses stably transfected K562 cells expressing human alpha4beta7 integrin.
Components:
This complex has 2 components.
Component 1
Name:
Integrin alpha-4
Synonyms:
CD49 antigen-like family member D CD49d antigen ITA4_HUMAN Integrin alpha-4 Integrin alpha-IV VLA-4 integrin alpha 4 precursor | integrin alpha-4 precursor
Type:
Membrane Protein
Mol. Mass.:
114897.35
Organism:
Homo sapiens (Human)
Description:
P13612
Residue:
1032
  
Component 2
Name:
Integrin beta-7
Synonyms:
ITB7_HUMAN Integrin alpha-4/beta-7 Integrin beta7
Type:
Membrane Protein
Mol. Mass.:
86893.88
Organism:
Homo sapiens (Human)
Description:
P26010
Residue:
798
  
Inhibitor
Name:
BDBM50437656
Synonyms:
CHEMBL2407888
Type:
Small organic molecule
Emp. Form.:
C28H35N7O6S
Mol. Mass.:
597.686
SMILES:
CCN(CC)c1ncc(N(c2cccnc2)S(C)(=O)=O)c(N[C@@H](Cc2ccc(OC(=O)N3CCCC3)cc2)C(O)=O)n1
: