Target
G protein-activated inward rectifier potassium channel 4
Ligand
BDBM50437958
Substrate
Meas. Tech.
ChEMBL_972867 (CHEMBL2411644)
IC50
780±n/a nM
Citation
 Wen, WWu, WRomaine, IMKaufmann, KDu, YSulikowski, GAWeaver, CDLindsley, CW Discovery of 'molecular switches' within a GIRK activator scaffold that afford selective GIRK inhibitors. Bioorg Med Chem Lett 23:4562-6 (2013)  
Target
Name:
G protein-activated inward rectifier potassium channel 4
Synonyms:
CIR GIRK-4 Heart KATP channel Inward rectifier K(+) channel Kir3.4 KCNJ5 Potassium channel, inwardly rectifying subfamily J member 5
Type:
PROTEIN
Mol. Mass.:
47658.06
Organism:
Homo sapiens (Human)
Description:
ChEMBL_107914
Residue:
419
  
Inhibitor
Name:
BDBM50437958
Synonyms:
CHEMBL2409124
Type:
Small organic molecule
Emp. Form.:
C19H19FN4O
Mol. Mass.:
338.3788
SMILES:
CC(C)c1cc(NC(=O)Nc2cccc(F)c2)n(n1)-c1ccccc1
: