Target
Aldo-keto reductase family 1 member B1
Ligand
BDBM50438788
Substrate
Meas. Tech.
ChEMBL_976987 (CHEMBL2416511)
IC50
10788±n/a nM
Citation
 Papastavrou, NChatzopoulou, MPegklidou, KNicolaou, I 1-Hydroxypyrazole as a bioisostere of the acetic acid moiety in a series of aldose reductase inhibitors. Bioorg Med Chem 21:4951-7 (2013)  
Target
Name:
Aldo-keto reductase family 1 member B1
Synonyms:
ALDR_RAT Akr1b4 Aldr1
Type:
PROTEIN
Mol. Mass.:
35797.87
Organism:
Rattus norvegicus
Description:
ChEMBL_1512484
Residue:
316
  
Inhibitor
Name:
BDBM50438788
Synonyms:
CHEMBL2413220
Type:
Small organic molecule
Emp. Form.:
C14H11N3O2
Mol. Mass.:
253.256
SMILES:
On1cc(cn1)-n1ccc(c1)C(=O)c1ccccc1
: