Target
Tyrosine-protein kinase JAK2
Ligand
BDBM50439038
Substrate
Meas. Tech.
ChEMBL_979760 (CHEMBL2421805)
Ki
3200±n/a nM
Citation
Target
Name:
Tyrosine-protein kinase JAK2
Synonyms:
JAK-2 JAK2_HUMAN Janus kinase 2 (JAK2) | Janus kinase 2 (a protein tyrosine kinase)
Type:
Protein
Mol. Mass.:
130684.68
Organism:
Homo sapiens (Human)
Description:
O60674
Residue:
1132
  
Inhibitor
Name:
BDBM50439038
Synonyms:
CHEMBL2420850
Type:
Small organic molecule
Emp. Form.:
C13H11ClN2O2
Mol. Mass.:
262.692
SMILES:
COc1cccc(C(=O)Nc2ccncc2)c1Cl
: