Target
Tyrosine-protein kinase JAK1
Ligand
BDBM50439038
Substrate
Meas. Tech.
ChEMBL_979759 (CHEMBL2421804)
Ki
>3500±n/a nM
Citation
Target
Name:
Tyrosine-protein kinase JAK1
Synonyms:
JAK-1 JAK1A JAK1_HUMAN Janus kinase 1 (JAK1) | Janus kinase 1 JAK1
Type:
Protein
Mol. Mass.:
133293.73
Organism:
Homo sapiens (Human)
Description:
P23458
Residue:
1154
  
Inhibitor
Name:
BDBM50439038
Synonyms:
CHEMBL2420850
Type:
Small organic molecule
Emp. Form.:
C13H11ClN2O2
Mol. Mass.:
262.692
SMILES:
COc1cccc(C(=O)Nc2ccncc2)c1Cl
: