Target
Casein kinase I isoform delta
Ligand
BDBM50439433
Substrate
Meas. Tech.
ChEMBL_977607 (CHEMBL2423574)
IC50
13±n/a nM
Citation
 Mente, SArnold, EButler, TChakrapani, SChandrasekaran, RCherry, KDiRico, KDoran, AFisher, KGalatsis, PGreen, MHayward, MHumphrey, JKnafels, JLi, JLiu, SMarconi, MMcDonald, SOhren, JParadis, VSneed, BWalton, KWager, T Ligand-protein interactions of selective casein kinase 1d inhibitors. J Med Chem 56:6819-28 (2013)  
Target
Name:
Casein kinase I isoform delta
Synonyms:
CKI-delta CSNK1D Casein kinase I delta Casein kinase I isoform delta (CK1D) KC1D_HUMAN | casein kinases 1 delta (CK1 delta)
Type:
Enzyme
Mol. Mass.:
47356.76
Organism:
Homo sapiens (Human)
Description:
P48730
Residue:
415
  
Inhibitor
Name:
BDBM50439433
Synonyms:
CHEMBL2420702
Type:
Small organic molecule
Emp. Form.:
C17H17FN4
Mol. Mass.:
296.3421
SMILES:
CNCc1cc(ccn1)-c1cn(C)nc1-c1ccc(F)cc1
: