Target
DNA-dependent protein kinase catalytic subunit
Ligand
BDBM50439863
Substrate
Meas. Tech.
ChEMBL_978844 (CHEMBL2423446)
IC50
5±n/a nM
Citation
 Cano, CSaravanan, KBailey, CBardos, JCurtin, NJFrigerio, MGolding, BTHardcastle, IRHummersone, MGMenear, KANewell, DRRichardson, CJShea, KSmith, GCThommes, PTing, AGriffin, RJ 1-substituted (Dibenzo[b,d]thiophen-4-yl)-2-morpholino-4H-chromen-4-ones endowed with dual DNA-PK/PI3-K inhibitory activity. J Med Chem 56:6386-401 (2013)  
Target
Name:
DNA-dependent protein kinase catalytic subunit
Synonyms:
DNA-PK catalytic subunit DNA-dependent protein kinase (DNA-PK) DNA-dependent protein kinase catalytic subunit (DNA-PK) HYRC PRKDC | PRKDC_HUMAN
Type:
Protein
Mol. Mass.:
469114.78
Organism:
Homo sapiens (Human)
Description:
P78527
Residue:
4128
  
Inhibitor
Name:
BDBM50439863
Synonyms:
CHEMBL2420285
Type:
Small organic molecule
Emp. Form.:
C32H35N3O4S
Mol. Mass.:
557.703
SMILES:
CN(C)CCN(C)CCOc1ccc(-c2cccc3c2oc(cc3=O)N2CCOCC2)c2sc3ccccc3c12
: