Target
Lysine-specific histone demethylase 1A
Ligand
BDBM50440475
Substrate
Meas. Tech.
ChEMBL_983177 (CHEMBL2428089)
IC50
34000±n/a nM
Citation
 Schmitt, MLHauser, ATCarlino, LPippel, MSchulz-Fincke, JMetzger, EWillmann, DYiu, TBarton, MSchüle, RSippl, WJung, M Nonpeptidic propargylamines as inhibitors of lysine specific demethylase 1 (LSD1) with cellular activity. J Med Chem 56:7334-42 (2013)  
Target
Name:
Lysine-specific histone demethylase 1A
Synonyms:
AOF2 Flavin-containing amine oxidase domain-containing protein 2 KDM1A KIAA0601 Lysine-specific demethylase 1 (LSD1) Lysine-specific histone demethylase 1 (LSD1)
Type:
Enzyme
Mol. Mass.:
92901.01
Organism:
Homo sapiens (Human)
Description:
O60341
Residue:
852
  
Inhibitor
Name:
BDBM50440475
Synonyms:
CHEMBL2426048
Type:
Small organic molecule
Emp. Form.:
C18H19NO2
Mol. Mass.:
281.349
SMILES:
OC(CNCC#C)COc1ccc(cc1)-c1ccccc1
: