Target
Lysine-specific histone demethylase 1A
Ligand
BDBM50440477
Substrate
Meas. Tech.
ChEMBL_983183 (CHEMBL2428095)
IC50
22200±n/a nM
Citation
 Schmitt, MLHauser, ATCarlino, LPippel, MSchulz-Fincke, JMetzger, EWillmann, DYiu, TBarton, MSchüle, RSippl, WJung, M Nonpeptidic propargylamines as inhibitors of lysine specific demethylase 1 (LSD1) with cellular activity. J Med Chem 56:7334-42 (2013)  
Target
Name:
Lysine-specific histone demethylase 1A
Synonyms:
AOF2 Flavin-containing amine oxidase domain-containing protein 2 KDM1A KIAA0601 Lysine-specific demethylase 1 (LSD1) Lysine-specific histone demethylase 1 (LSD1)
Type:
Enzyme
Mol. Mass.:
92901.01
Organism:
Homo sapiens (Human)
Description:
O60341
Residue:
852
  
Inhibitor
Name:
BDBM50440477
Synonyms:
CHEMBL2426053
Type:
Small organic molecule
Emp. Form.:
C17H18BrNO2
Mol. Mass.:
348.234
SMILES:
CN(CC#C)CC(O)COc1ccc2cc(Br)ccc2c1
: