Target
ATP-dependent DNA helicase Q1
Ligand
BDBM50440538
Substrate
Meas. Tech.
ChEMBL_983200 (CHEMBL2428259)
IC50
>50000±n/a nM
Citation
 Rosenthal, ASDexheimer, TSGileadi, ONguyen, GHChu, WKHickson, IDJadhav, ASimeonov, AMaloney, DJ Synthesis and SAR studies of 5-(pyridin-4-yl)-1,3,4-thiadiazol-2-amine derivatives as potent inhibitors of Bloom helicase. Bioorg Med Chem Lett 23:5660-6 (2013)  
Target
Name:
ATP-dependent DNA helicase Q1
Synonyms:
DNA helicase, RecQ-like type 1 RECQ1 RECQL RecQ protein-like 1
Type:
PROTEIN
Mol. Mass.:
73468.16
Organism:
Homo sapiens (Human)
Description:
ChEMBL_103669
Residue:
649
  
Inhibitor
Name:
BDBM50440538
Synonyms:
CHEMBL2426174
Type:
Small organic molecule
Emp. Form.:
C18H12N8OS
Mol. Mass.:
388.406
SMILES:
O=C(Nc1nnc(s1)-c1ccncc1)Nc1ccc(-c2cn[nH]c2)c(c1)C#N
: