Target
Tyrosine-protein phosphatase non-receptor type 6
Ligand
BDBM50391428
Substrate
Meas. Tech.
ChEMBL_984734 (CHEMBL2432108)
IC50
3670±n/a nM
Citation
 Liu, WYu, BXu, GXu, WRLoh, MLTang, LDQu, CK Identification of cryptotanshinone as an inhibitor of oncogenic protein tyrosine phosphatase SHP2 (PTPN11). J Med Chem 56:7212-21 (2013)  
Target
Name:
Tyrosine-protein phosphatase non-receptor type 6
Synonyms:
HCP PTP1C Protein tyrosine phosphatase SHP-1 (SHP-1) Protein-tyrosine phosphatase SHP-1 Tyrosine-protein phosphatase non-receptor type 6 | Tyrosine-protein phosphatase non-receptor type 6 (SHP1)
Type:
Protein
Mol. Mass.:
67570.41
Organism:
Homo sapiens (Human)
Description:
P29350
Residue:
595
  
Inhibitor
Name:
BDBM50391428
Synonyms:
CHEMBL1358724
Type:
Small organic molecule
Emp. Form.:
C18H14O3
Mol. Mass.:
278.302
SMILES:
CC1COC2=C1C(=O)C(=O)c1c2ccc2c(C)cccc12
: