Target
Tyrosine-protein phosphatase non-receptor type 11
Ligand
BDBM50391428
Substrate
Meas. Tech.
ChEMBL_984736 (CHEMBL2432110)
IC50
3940±n/a nM
Citation
 Liu, WYu, BXu, GXu, WRLoh, MLTang, LDQu, CK Identification of cryptotanshinone as an inhibitor of oncogenic protein tyrosine phosphatase SHP2 (PTPN11). J Med Chem 56:7212-21 (2013)  
Target
Name:
Tyrosine-protein phosphatase non-receptor type 11
Synonyms:
3.1.3.48 PTP-1D PTP2C Protein Tyrosine Phosphatase PPN11/Shp2 Protein-Tyrosine Phosphatase SHP-2 Protein-tyrosine phosphatase 2C SH-PTP3 SHP2 Src homology phosphatase 2 (SHP-2) Tyrosine-protein phosphatase non-receptor type 11 (SHP-2) | Tyrosine-protein phosphatase non-receptor type 11 (SHP2)
Type:
Protein phosphatase
Mol. Mass.:
68443.59
Organism:
Homo sapiens (Human)
Description:
Q06124
Residue:
593
  
Inhibitor
Name:
BDBM50391428
Synonyms:
CHEMBL1358724
Type:
Small organic molecule
Emp. Form.:
C18H14O3
Mol. Mass.:
278.302
SMILES:
CC1COC2=C1C(=O)C(=O)c1c2ccc2c(C)cccc12
: