Target
Tyrosine-protein phosphatase non-receptor type 6
Ligand
BDBM51317
Substrate
Meas. Tech.
ChEMBL_984734 (CHEMBL2432108)
IC50
1970±n/a nM
Citation
 Liu, WYu, BXu, GXu, WRLoh, MLTang, LDQu, CK Identification of cryptotanshinone as an inhibitor of oncogenic protein tyrosine phosphatase SHP2 (PTPN11). J Med Chem 56:7212-21 (2013)  
Target
Name:
Tyrosine-protein phosphatase non-receptor type 6
Synonyms:
HCP PTP1C Protein tyrosine phosphatase SHP-1 (SHP-1) Protein-tyrosine phosphatase SHP-1 Tyrosine-protein phosphatase non-receptor type 6 | Tyrosine-protein phosphatase non-receptor type 6 (SHP1)
Type:
Protein
Mol. Mass.:
67570.41
Organism:
Homo sapiens (Human)
Description:
P29350
Residue:
595
  
Inhibitor
Name:
BDBM51317
Synonyms:
1,6-dimethylnaphtho[1,2-g][1]benzofuran-10,11-dione 1,6-dimethylnaphtho[1,2-g]benzofuran-10,11-quinone SMR000445578 acs.jmedchem.1c00409_ST.675 | cid_114917
Type:
Small organic molecule
Emp. Form.:
C18H12O3
Mol. Mass.:
276.2861
SMILES:
Cc1coc-2c1C(=O)C(=O)c1c-2ccc2c(C)cccc12
: