Target
Tyrosine-protein phosphatase non-receptor type 11
Ligand
BDBM51317
Substrate
Meas. Tech.
ChEMBL_984736 (CHEMBL2432110)
IC50
2570±n/a nM
Citation
 Liu, WYu, BXu, GXu, WRLoh, MLTang, LDQu, CK Identification of cryptotanshinone as an inhibitor of oncogenic protein tyrosine phosphatase SHP2 (PTPN11). J Med Chem 56:7212-21 (2013)  
Target
Name:
Tyrosine-protein phosphatase non-receptor type 11
Synonyms:
3.1.3.48 PTP-1D PTP2C Protein Tyrosine Phosphatase PPN11/Shp2 Protein-Tyrosine Phosphatase SHP-2 Protein-tyrosine phosphatase 2C SH-PTP3 SHP2 Src homology phosphatase 2 (SHP-2) Tyrosine-protein phosphatase non-receptor type 11 (SHP-2) | Tyrosine-protein phosphatase non-receptor type 11 (SHP2)
Type:
Protein phosphatase
Mol. Mass.:
68443.59
Organism:
Homo sapiens (Human)
Description:
Q06124
Residue:
593
  
Inhibitor
Name:
BDBM51317
Synonyms:
1,6-dimethylnaphtho[1,2-g][1]benzofuran-10,11-dione 1,6-dimethylnaphtho[1,2-g]benzofuran-10,11-quinone SMR000445578 acs.jmedchem.1c00409_ST.675 | cid_114917
Type:
Small organic molecule
Emp. Form.:
C18H12O3
Mol. Mass.:
276.2861
SMILES:
Cc1coc-2c1C(=O)C(=O)c1c-2ccc2c(C)cccc12
: