Target
Mitogen-activated protein kinase 15
Ligand
BDBM50441090
Substrate
Meas. Tech.
ChEMBL_986148 (CHEMBL2432948)
IC50
400±n/a nM
Citation
 Huart, ASSaxty, BMerritt, ANekulova, MLewis, SHuang, YVojtesek, BKettleborough, CHupp, TR A Casein kinase 1/Checkpoint kinase 1 pyrazolo-pyridine protein kinase inhibitor as novel activator of the p53 pathway. Bioorg Med Chem Lett 23:5578-85 (2013)  
Target
Name:
Mitogen-activated protein kinase 15
Synonyms:
ERK-8 ERK8 MAPK15 Mitogen-activated protein kinase 15
Type:
Serine/threonine-protein kinase
Mol. Mass.:
59850.14
Organism:
Homo sapiens (Human)
Description:
gi_95147356
Residue:
544
  
Inhibitor
Name:
BDBM50441090
Synonyms:
CHEMBL2430323 | US9669028, 114 N-(3-(3-methyl-1H-pyrazolo[3,4-b]pyridin-5-yl)phenyl)acetamide
Type:
Small organic molecule
Emp. Form.:
C15H14N4O
Mol. Mass.:
266.2979
SMILES:
CC(=O)Nc1cccc(c1)-c1cnc2[nH]nc(C)c2c1
: