Target
Delta-aminolevulinic acid dehydratase
Ligand
BDBM50441101
Substrate
Meas. Tech.
ChEMBL_983894 (CHEMBL2433504)
IC50
119000±n/a nM
Citation
 Lentz, CSStumpfe, DBajorath, JFamulok, MHoerauf, APfarr, KM New chemotypes for wALADin1-like inhibitors of delta-aminolevulinic acid dehydratase from Wolbachia endobacteria. Bioorg Med Chem Lett 23:5558-62 (2013)  
Target
Name:
Delta-aminolevulinic acid dehydratase
Synonyms:
ALAD HEM2_HUMAN | Porphobilinogen synthase
Type:
PROTEIN
Mol. Mass.:
36296.00
Organism:
Homo sapiens (Human)
Description:
ChEMBL_1365623
Residue:
330
  
Inhibitor
Name:
BDBM50441101
Synonyms:
CHEMBL2430571
Type:
Small organic molecule
Emp. Form.:
C20H15FN4O3
Mol. Mass.:
378.3565
SMILES:
OC(=O)c1ccc2n(Cc3ccc(F)cc3)c(=O)n(Cc3ncccn3)c2c1
: