Target
Bromodomain-containing protein 4
Ligand
BDBM50441172
Substrate
Meas. Tech.
ChEMBL_985086 (CHEMBL2433591)
IC50
1259±n/a nM
Citation
 Mirguet, OGosmini, RToum, JClément, CABarnathan, MBrusq, JMMordaunt, JEGrimes, RMCrowe, MPineau, OAjakane, MDaugan, AJeffrey, PCutler, LHaynes, ACSmithers, NNChung, CWBamborough, PUings, IJLewis, AWitherington, JParr, NPrinjha, RKNicodème, E Discovery of epigenetic regulator I-BET762: lead optimization to afford a clinical candidate inhibitor of the BET bromodomains. J Med Chem 56:7501-15 (2013)  
Target
Name:
Bromodomain-containing protein 4
Synonyms:
BRD4 Bromodomain-containing protein 4 (BRD4) Protein HUNK1
Type:
Protein
Mol. Mass.:
152264.84
Organism:
Homo sapiens (Human)
Description:
O60885
Residue:
1362
  
Inhibitor
Name:
BDBM50441172
Synonyms:
CHEMBL2430896
Type:
Small organic molecule
Emp. Form.:
C26H23N5O2
Mol. Mass.:
437.4931
SMILES:
Cc1nnc2C(NC(=O)OCc3ccccc3)N=C(c3ccc(C)cc3)c3ccccc3-n12
: