Target
Mitogen-activated protein kinase kinase kinase 11
Ligand
BDBM50441571
Substrate
Meas. Tech.
ChEMBL_986642 (CHEMBL2437702)
IC50
120±n/a nM
Citation
 Goodfellow, VSLoweth, CJRavula, SBWiemann, TNguyen, TXu, YTodd, DESheppard, DPollack, SPolesskaya, OMarker, DFDewhurst, SGelbard, HA Discovery, synthesis, and characterization of an orally bioavailable, brain penetrant inhibitor of mixed lineage kinase 3. J Med Chem 56:8032-48 (2013)  
Target
Name:
Mitogen-activated protein kinase kinase kinase 11
Synonyms:
M3K11_MOUSE Mixed lineage kinase 3 | Mlk3
Type:
PROTEIN
Mol. Mass.:
93237.89
Organism:
Mus musculus
Description:
ChEMBL_107667
Residue:
850
  
Inhibitor
Name:
BDBM50441571
Synonyms:
CHEMBL2436982 US9814704, Example 18
Type:
Small organic molecule
Emp. Form.:
C21H20N4O3
Mol. Mass.:
376.4085
SMILES:
COc1cc(cc(OC)c1OC)-c1cnc2[nH]cc(-c3ccc(N)nc3)c2c1
: