Target
Cytochrome P450 1A2
Ligand
BDBM50441716
Substrate
Meas. Tech.
ChEMBL_988277 (CHEMBL2439731)
IC50
>60000±n/a nM
Citation
 Skerlj, RBridger, GZhou, YBourque, EMcEachern, EMetz, MHarwig, CLi, TSYang, WBogucki, DZhu, YLangille, JVeale, DBa, TBey, MBaird, IKaller, AKrumpak, MLeitch, DSatori, MVocadlo, KGuay, DNan, SYee, HCrawford, JChen, GWilson, TCarpenter, BGauthier, DMacfarland, RMosi, RBodart, VWong, RFricker, SSchols, D Design of substituted imidazolidinylpiperidinylbenzoic acids as chemokine receptor 5 antagonists: potent inhibitors of R5 HIV-1 replication. J Med Chem 56:8049-65 (2013)  
Target
Name:
Cytochrome P450 1A2
Synonyms:
CP1A2_HUMAN CYPIA2 Cytochrome P(3)450 Cytochrome P450 1A2 (CYP1A2) Cytochrome P450-P3
Type:
Enzyme
Mol. Mass.:
58423.38
Organism:
Homo sapiens (Human)
Description:
P05177
Residue:
516
  
Inhibitor
Name:
BDBM50441716
Synonyms:
CHEMBL2434978
Type:
Small organic molecule
Emp. Form.:
C32H36N4O4S
Mol. Mass.:
572.718
SMILES:
OC(=O)c1ccc(Sc2ccc(CN3CCC(CC3)N3[C@@H](CN(C4CCOCC4)C3=O)c3ccccc3)cn2)cc1
: