Target
Receptor-type tyrosine-protein kinase FLT3
Ligand
BDBM50441795
Substrate
Meas. Tech.
ChEMBL_988810 (CHEMBL2439292)
IC50
180±n/a nM
Citation
 Rongved, PKirsch, GBouaziz, ZJose, JLe Borgne, M Indenoindoles and cyclopentacarbazoles as bioactive compounds: synthesis and biological applications. Eur J Med Chem 69:465-79 (2013)  
Target
Name:
Receptor-type tyrosine-protein kinase FLT3
Synonyms:
CD135 FL cytokine receptor FLK2 FLT3 Fetal liver kinase-2 Fms-like tyrosine kinase 3 (Flt-3) STK-1 Stem cell tyrosine kinase 1
Type:
Enzyme
Mol. Mass.:
112888.62
Organism:
Homo sapiens (Human)
Description:
P36888
Residue:
993
  
Inhibitor
Name:
BDBM50441795
Synonyms:
CHEMBL2436172
Type:
Small organic molecule
Emp. Form.:
C18H15NO3
Mol. Mass.:
293.3166
SMILES:
CC(C)n1c2-c3ccccc3C(=O)c2c2c(O)ccc(O)c12
: