Target
Thermolysin
Ligand
BDBM50442257
Substrate
Meas. Tech.
ChEMBL_991849 (CHEMBL2446099)
Kd
32±n/a nM
Citation
 Sun, QYang, QGong, SFu, QXiao, Q Synthesis and enzymatic evaluation of phosphoramidon and itsß anomer: Anomerization ofa-l-rhamnose triacetate upon phosphitylation. Bioorg Med Chem 21:6778-87 (2013)  
Target
Name:
Thermolysin
Synonyms:
THER_BACTH | npr
Type:
PROTEIN
Mol. Mass.:
60097.54
Organism:
Bacillus thermoproteolyticus
Description:
ChEMBL_1468794
Residue:
548
  
Inhibitor
Name:
BDBM50442257
Synonyms:
CHEMBL2028192
Type:
Small organic molecule
Emp. Form.:
C23H32N3O10P
Mol. Mass.:
541.4891
SMILES:
CC(C)C[C@H](NP([O-])(=O)O[C@@H]1O[C@@H](C)[C@H](O)[C@@H](O)[C@H]1O)C(=O)N[C@@H](Cc1c[nH]c2ccccc12)C([O-])=O
: