Target
Rho-associated protein kinase 2
Ligand
BDBM50442811
Substrate
Meas. Tech.
ChEMBL_990098 (CHEMBL2444040)
IC50
1.2±n/a nM
Citation
 Boland, SDefert, OAlen, JBourin, ACastermans, KKindt, NBoumans, NPanitti, LVan de Velde, SStalmans, ILeysen, D 3-[2-(Aminomethyl)-5-[(pyridin-4-yl)carbamoyl]phenyl] benzoates as soft ROCK inhibitors. Bioorg Med Chem Lett 23:6442-6 (2013)  
Target
Name:
Rho-associated protein kinase 2
Synonyms:
KIAA0619 ROCK2 Rho kinase 2 (ROCKII) Rho-associated protein kinase 2 (ROCK2) Rho-associated protein kinase 2/Transforming protein RhoA Rho-associated, coiled-coil-containing protein kinase II p164 ROCK-2
Type:
Protein
Mol. Mass.:
160885.43
Organism:
Homo sapiens (Human)
Description:
O75116
Residue:
1388
  
Inhibitor
Name:
BDBM50442811
Synonyms:
CHEMBL2440742
Type:
Small organic molecule
Emp. Form.:
C20H18FN3O
Mol. Mass.:
335.3748
SMILES:
CC(N)c1ccc(cc1-c1ccc(F)cc1)C(=O)Nc1ccncc1
: