Target
Bromodomain-containing protein 4
Ligand
BDBM50443249
Substrate
Meas. Tech.
ChEMBL_1277431 (CHEMBL3089621)
Ki
19740±n/a nM
Citation
 Zhang, GPlotnikov, ANRusinova, EShen, TMorohashi, KJoshua, JZeng, LMujtaba, SOhlmeyer, MZhou, MM Structure-guided design of potent diazobenzene inhibitors for the BET bromodomains. J Med Chem 56:9251-64 (2013)  
Target
Name:
Bromodomain-containing protein 4
Synonyms:
BRD4 Bromodomain-containing protein 4 (BRD4) Protein HUNK1
Type:
Protein
Mol. Mass.:
152264.84
Organism:
Homo sapiens (Human)
Description:
O60885
Residue:
1362
  
Inhibitor
Name:
BDBM50443249
Synonyms:
Ischemin
Type:
Small organic molecule
Emp. Form.:
C15H17N3O4S
Mol. Mass.:
335.378
SMILES:
Cc1cc(N=Nc2cc(c(C)cc2C)S(O)(=O)=O)c(N)cc1O
: