Target
Heat shock cognate 71 kDa protein
Ligand
BDBM50443574
Substrate
Meas. Tech.
ChEMBL_1279153 (CHEMBL3095088)
Kd
1900±n/a nM
Citation
 Li, XSrinivasan, SRConnarn, JAhmad, AYoung, ZTKabza, AMZuiderweg, ERSun, DGestwicki, JE Analogs of the Allosteric Heat Shock Protein 70 (Hsp70) Inhibitor, MKT-077, as Anti-Cancer Agents. ACS Med Chem Lett 4:1042-7 (2013)  
Target
Name:
Heat shock cognate 71 kDa protein
Synonyms:
HSC70 HSP7C_HUMAN HSPA8 heat shock 70kDa protein 8 isoform 2
Type:
Enzyme Catalytic Domain
Mol. Mass.:
70887.67
Organism:
Homo sapiens (Human)
Description:
gi_5729877
Residue:
646
  
Inhibitor
Name:
BDBM50443574
Synonyms:
CHEMBL3091726
Type:
Small organic molecule
Emp. Form.:
C35H44FN6O3S3
Mol. Mass.:
711.955
SMILES:
CCn1c(=O)c(sc1=Cc1cccc[n+]1CCCCCCNC(=O)CCCC[C@@H]1SC[C@@H]2NC(=O)N[C@H]12)=C1Sc2c(cccc2F)N1C
: