Target
Heat shock cognate 71 kDa protein
Ligand
BDBM50443579
Substrate
Meas. Tech.
ChEMBL_1279153 (CHEMBL3095088)
Kd
2400±n/a nM
Citation
 Li, XSrinivasan, SRConnarn, JAhmad, AYoung, ZTKabza, AMZuiderweg, ERSun, DGestwicki, JE Analogs of the Allosteric Heat Shock Protein 70 (Hsp70) Inhibitor, MKT-077, as Anti-Cancer Agents. ACS Med Chem Lett 4:1042-7 (2013)  
Target
Name:
Heat shock cognate 71 kDa protein
Synonyms:
HSC70 HSP7C_HUMAN HSPA8 heat shock 70kDa protein 8 isoform 2
Type:
Enzyme Catalytic Domain
Mol. Mass.:
70887.67
Organism:
Homo sapiens (Human)
Description:
gi_5729877
Residue:
646
  
Inhibitor
Name:
BDBM50443579
Synonyms:
CHEMBL3091725
Type:
Small organic molecule
Emp. Form.:
C35H38FN6O3S4
Mol. Mass.:
737.972
SMILES:
CCn1c(=O)c(sc1=Cc1scc[n+]1Cc1ccc(CNC(=O)CCCC[C@@H]2SC[C@@H]3NC(=O)N[C@H]23)cc1)=C1Sc2cccc(F)c2N1C
: