Target
Sonic hedgehog protein
Ligand
BDBM50443915
Substrate
Meas. Tech.
ChEMBL_1277855 (CHEMBL3097789)
IC50
2.2±n/a nM
Citation
 Xin, MWen, JTang, FTu, CShen, HZhao, X The discovery of novel N-(2-pyrimidinylamino) benzamide derivatives as potent hedgehog signaling pathway inhibitors. Bioorg Med Chem Lett 23:6777-83 (2013)  
Target
Name:
Sonic hedgehog protein
Synonyms:
Hhg1 Shh
Type:
Protein
Mol. Mass.:
47784.50
Organism:
Mus musculus (Mouse)
Description:
Q62226
Residue:
437
  
Inhibitor
Name:
BDBM50443915
Synonyms:
CHEMBL3091734
Type:
Small organic molecule
Emp. Form.:
C26H23FN4O
Mol. Mass.:
426.4854
SMILES:
Cc1cccc(C)c1NC(=O)c1ccc(Nc2ncc(C)c(n2)-c2ccc(F)cc2)cc1
: