Target
Glucocorticoid receptor
Ligand
BDBM50444389
Substrate
Meas. Tech.
ChEMBL_1279595 (CHEMBL3097677)
IC50
83±n/a nM
Citation
 DiSalvo, DKuzmich, DBentzien, JRegan, JKukulka, AFadra-Khan, TNelson, RHarcken, CThomson, DNabozny, G Substituted phenyl as a steroid A-ring mimetic: providing agonist activity to a class of arylsulfonamide nonsteroidal glucocorticoid ligands. Bioorg Med Chem Lett 23:6645-9 (2013)  
Target
Name:
Glucocorticoid receptor
Synonyms:
GCR_HUMAN GRL Glucocorticoid receptor (GRFP) Nuclear receptor subfamily 3 group C member 1
Type:
Enzyme
Mol. Mass.:
85656.87
Organism:
Homo sapiens (Human)
Description:
P04150
Residue:
777
  
Inhibitor
Name:
BDBM50444389
Synonyms:
CHEMBL3094469
Type:
Small organic molecule
Emp. Form.:
C20H27NO2S
Mol. Mass.:
345.499
SMILES:
CCC(Cc1ccccc1C)NS(=O)(=O)c1c(C)cc(C)cc1C
: