Target
Mineralocorticoid receptor
Ligand
BDBM50444408
Substrate
Meas. Tech.
ChEMBL_1279593 (CHEMBL3097675)
IC50
1100±n/a nM
Citation
 DiSalvo, DKuzmich, DBentzien, JRegan, JKukulka, AFadra-Khan, TNelson, RHarcken, CThomson, DNabozny, G Substituted phenyl as a steroid A-ring mimetic: providing agonist activity to a class of arylsulfonamide nonsteroidal glucocorticoid ligands. Bioorg Med Chem Lett 23:6645-9 (2013)  
Target
Name:
Mineralocorticoid receptor
Synonyms:
MCR MLR NR3C2 | Nuclear receptor subfamily 3 group C member 2
Type:
Enzyme
Mol. Mass.:
107076.42
Organism:
Homo sapiens (Human)
Description:
P08235
Residue:
984
  
Inhibitor
Name:
BDBM50444408
Synonyms:
CHEMBL3094471
Type:
Small organic molecule
Emp. Form.:
C20H27NO2S
Mol. Mass.:
345.499
SMILES:
CCC(Cc1ccc(C)cc1)NS(=O)(=O)c1c(C)cc(C)cc1C
: