Target
Progesterone receptor
Ligand
BDBM50444397
Substrate
Meas. Tech.
ChEMBL_1279594 (CHEMBL3097676)
IC50
860±n/a nM
Citation
 DiSalvo, DKuzmich, DBentzien, JRegan, JKukulka, AFadra-Khan, TNelson, RHarcken, CThomson, DNabozny, G Substituted phenyl as a steroid A-ring mimetic: providing agonist activity to a class of arylsulfonamide nonsteroidal glucocorticoid ligands. Bioorg Med Chem Lett 23:6645-9 (2013)  
Target
Name:
Progesterone receptor
Synonyms:
NR3C3 PGR PRGR_HUMAN | progesterone
Type:
Protein
Mol. Mass.:
98979.52
Organism:
Homo sapiens (Human)
Description:
P06401
Residue:
933
  
Inhibitor
Name:
BDBM50444397
Synonyms:
CHEMBL3094482
Type:
Small organic molecule
Emp. Form.:
C21H29NO3S
Mol. Mass.:
375.525
SMILES:
CCC(Cc1ccc(O)c(C)c1C)NS(=O)(=O)c1c(C)cc(C)cc1C
: