Target
Poly [ADP-ribose] polymerase tankyrase-1
Ligand
BDBM50444544
Substrate
Meas. Tech.
ChEMBL_1281549 (CHEMBL3102115)
IC50
36±n/a nM
Citation
 Nathubhai, AWood, PJLloyd, MDThompson, ASThreadgill, MD Design and Discovery of 2-Arylquinazolin-4-ones as Potent and Selective Inhibitors of Tankyrases. ACS Med Chem Lett 4:1173-7 (2013)  
Target
Name:
Poly [ADP-ribose] polymerase tankyrase-1
Synonyms:
(ARTD5 or PARP5a) PARPL Poly [ADP-ribose] polymerase tankyrase-1 TINF1 TNKS1 Tankyrase 1 Tankyrase-1 Tankyrase-1 (TNKS1)
Type:
Enzyme
Mol. Mass.:
142058.03
Organism:
Homo sapiens (Human)
Description:
O95271
Residue:
1327
  
Inhibitor
Name:
BDBM50444544
Synonyms:
CHEMBL3098939
Type:
Small organic molecule
Emp. Form.:
C15H11ClN2O
Mol. Mass.:
270.714
SMILES:
Cc1cccc2c1nc([nH]c2=O)-c1ccc(Cl)cc1
: