Target
Proline racemase
Ligand
BDBM50444845
Substrate
Meas. Tech.
ChEMBL_1282556 (CHEMBL3101223)
Ki
5800±n/a nM
Citation
 Harty, MNagar, MAtkinson, LLegay, CMDerksen, DJBearne, SL Inhibition of serine and proline racemases by substrate-product analogues. Bioorg Med Chem Lett 24:390-3 (2013)  
Target
Name:
Proline racemase
Synonyms:
prdF
Type:
PROTEIN
Mol. Mass.:
32973.46
Organism:
Clostridium sticklandii
Description:
ChEMBL_107984
Residue:
299
  
Inhibitor
Name:
BDBM50444845
Synonyms:
CHEMBL1235532
Type:
Small organic molecule
Emp. Form.:
C5H4NO2
Mol. Mass.:
110.0913
SMILES:
[O-]C(=O)c1ccc[nH]1
: