Target
Proline racemase
Ligand
BDBM50444846
Substrate
Meas. Tech.
ChEMBL_1282557 (CHEMBL3101224)
Ki
111000000±n/a nM
Citation
 Harty, MNagar, MAtkinson, LLegay, CMDerksen, DJBearne, SL Inhibition of serine and proline racemases by substrate-product analogues. Bioorg Med Chem Lett 24:390-3 (2013)  
Target
Name:
Proline racemase
Synonyms:
prdF
Type:
PROTEIN
Mol. Mass.:
32973.46
Organism:
Clostridium sticklandii
Description:
ChEMBL_107984
Residue:
299
  
Inhibitor
Name:
BDBM50444846
Synonyms:
CHEMBL3099361
Type:
Small organic molecule
Emp. Form.:
C8H13NO2
Mol. Mass.:
155.1943
SMILES:
[O-]C(=O)C12CCC[NH+]1CCC2
: