Target
Transporter
Ligand
BDBM50444860
Substrate
Meas. Tech.
ChEMBL_1282844 (CHEMBL3102345)
Ki
8.4±n/a nM
Citation
 Sharma, HSantra, SDebnath, JAntonio, TReith, MDutta, A Flexible and biomimetic analogs of triple uptake inhibitor 4-((((3S,6S)-6-benzhydryltetrahydro-2H-pyran-3-yl)amino)methyl)phenol: Synthesis, biological characterization, and development of a pharmacophore model. Bioorg Med Chem 22:311-24 (2013)  
Target
Name:
Transporter
Synonyms:
NE transporter Norepinephrine transporter(NET)
Type:
Multi-pass membrane protein
Mol. Mass.:
69236.90
Organism:
Rattus norvegicus (rat)
Description:
Q63380
Residue:
617
  
Inhibitor
Name:
BDBM50444860
Synonyms:
CHEMBL3099495
Type:
Small organic molecule
Emp. Form.:
C25H26F2N2O
Mol. Mass.:
408.4835
SMILES:
Nc1ccc(CN[C@H]2CC[C@H](OC2)C(c2ccc(F)cc2)c2ccc(F)cc2)cc1
: