Target
Transporter
Ligand
BDBM50444861
Substrate
Meas. Tech.
ChEMBL_1282844 (CHEMBL3102345)
Ki
6.1±n/a nM
Citation
 Sharma, HSantra, SDebnath, JAntonio, TReith, MDutta, A Flexible and biomimetic analogs of triple uptake inhibitor 4-((((3S,6S)-6-benzhydryltetrahydro-2H-pyran-3-yl)amino)methyl)phenol: Synthesis, biological characterization, and development of a pharmacophore model. Bioorg Med Chem 22:311-24 (2013)  
Target
Name:
Transporter
Synonyms:
NE transporter Norepinephrine transporter(NET)
Type:
Multi-pass membrane protein
Mol. Mass.:
69236.90
Organism:
Rattus norvegicus (rat)
Description:
Q63380
Residue:
617
  
Inhibitor
Name:
BDBM50444861
Synonyms:
CHEMBL3099494
Type:
Small organic molecule
Emp. Form.:
C27H27F2NO2
Mol. Mass.:
435.5056
SMILES:
Fc1ccc(cc1)C([C@@H]1CC[C@@H](CO1)NCc1ccc2OCCc2c1)c1ccc(F)cc1
: