Target
Transporter
Ligand
BDBM50444862
Substrate
Meas. Tech.
ChEMBL_1282844 (CHEMBL3102345)
Ki
4.2±n/a nM
Citation
 Sharma, HSantra, SDebnath, JAntonio, TReith, MDutta, A Flexible and biomimetic analogs of triple uptake inhibitor 4-((((3S,6S)-6-benzhydryltetrahydro-2H-pyran-3-yl)amino)methyl)phenol: Synthesis, biological characterization, and development of a pharmacophore model. Bioorg Med Chem 22:311-24 (2013)  
Target
Name:
Transporter
Synonyms:
NE transporter Norepinephrine transporter(NET)
Type:
Multi-pass membrane protein
Mol. Mass.:
69236.90
Organism:
Rattus norvegicus (rat)
Description:
Q63380
Residue:
617
  
Inhibitor
Name:
BDBM50444862
Synonyms:
CHEMBL3099493
Type:
Small organic molecule
Emp. Form.:
C25H25F2NO3
Mol. Mass.:
425.4677
SMILES:
O[C@@H]1C[C@H](OC[C@H]1NCc1ccc(O)cc1)C(c1ccc(F)cc1)c1ccc(F)cc1
: