Target
Transporter
Ligand
BDBM50444871
Substrate
Meas. Tech.
ChEMBL_1282844 (CHEMBL3102345)
Ki
38±n/a nM
Citation
 Sharma, HSantra, SDebnath, JAntonio, TReith, MDutta, A Flexible and biomimetic analogs of triple uptake inhibitor 4-((((3S,6S)-6-benzhydryltetrahydro-2H-pyran-3-yl)amino)methyl)phenol: Synthesis, biological characterization, and development of a pharmacophore model. Bioorg Med Chem 22:311-24 (2013)  
Target
Name:
Transporter
Synonyms:
NE transporter Norepinephrine transporter(NET)
Type:
Multi-pass membrane protein
Mol. Mass.:
69236.90
Organism:
Rattus norvegicus (rat)
Description:
Q63380
Residue:
617
  
Inhibitor
Name:
BDBM50444871
Synonyms:
CHEMBL3099502
Type:
Small organic molecule
Emp. Form.:
C27H31NO2
Mol. Mass.:
401.5405
SMILES:
Oc1ccc(CN[C@H]2CC[C@@H](CCC(c3ccccc3)c3ccccc3)OC2)cc1
: