Target
Muscarinic acetylcholine receptor M5
Ligand
BDBM50445225
Substrate
Meas. Tech.
ChEMBL_1284790 (CHEMBL3107813)
IC50
5670±n/a nM
Citation
 Gentry, PRKokubo, MBridges, TMKett, NRHarp, JMCho, HPSmith, EChase, PHodder, PSNiswender, CMDaniels, JSConn, PJWood, MRLindsley, CW Discovery of the first M5-selective and CNS penetrant negative allosteric modulator (NAM) of a muscarinic acetylcholine receptor: (S)-9b-(4-chlorophenyl)-1-(3,4-difluorobenzoyl)-2,3-dihydro-1H-imidazo[2,1-a]isoindol-5(9bH)-one (ML375). J Med Chem 56:9351-5 (2013)  
Target
Name:
Muscarinic acetylcholine receptor M5
Synonyms:
ACM5_RAT Chrm-5 Muscarinic acetylcholine receptor | Muscarinic acetylcholine receptor M5
Type:
Enzyme Catalytic Domain
Mol. Mass.:
60161.80
Organism:
RAT
Description:
Cholinergic, muscarinic M5 CHRM5 RAT::P08911
Residue:
531
  
Inhibitor
Name:
BDBM50445225
Synonyms:
CHEMBL1459098
Type:
Small organic molecule
Emp. Form.:
C23H17FN2O2
Mol. Mass.:
372.3917
SMILES:
Fc1ccc(cc1)C(=O)N1CCN2C(=O)c3ccccc3C12c1ccccc1
: