Target
ALK tyrosine kinase receptor
Ligand
BDBM50445473
Substrate
Meas. Tech.
ChEMBL_1284309 (CHEMBL3108330)
IC50
180±n/a nM
Citation
 El Amrani, MLai, DDebbab, AAly, AHSiems, KSeidel, CSchnekenburger, MGaigneaux, ADiederich, MFeger, DLin, WProksch, P Protein kinase and HDAC inhibitors from the endophytic fungus Epicoccum nigrum. J Nat Prod 77:49-56 (2014)  
Target
Name:
ALK tyrosine kinase receptor
Synonyms:
ALK ALK_HUMAN CD_antigen: CD246
Type:
Protein
Mol. Mass.:
176453.10
Organism:
Homo sapiens (Human)
Description:
Q9UM73
Residue:
1620
  
Inhibitor
Name:
BDBM50445473
Synonyms:
CHEMBL3104851
Type:
Small organic molecule
Emp. Form.:
C18H14O9
Mol. Mass.:
374.2984
SMILES:
Cc1c(O)c(O)c2O[C@H]3O[C@H](C(=O)c4c(O)c(O)c(O)c(C)c34)c2c1C=O
: