Target
Tyrosine-protein kinase receptor UFO
Ligand
BDBM50445473
Substrate
Meas. Tech.
ChEMBL_1284306 (CHEMBL3108327)
IC50
160±n/a nM
Citation
 El Amrani, MLai, DDebbab, AAly, AHSiems, KSeidel, CSchnekenburger, MGaigneaux, ADiederich, MFeger, DLin, WProksch, P Protein kinase and HDAC inhibitors from the endophytic fungus Epicoccum nigrum. J Nat Prod 77:49-56 (2014)  
Target
Name:
Tyrosine-protein kinase receptor UFO
Synonyms:
AXL TEL/AXL UFO | UFO_HUMAN
Type:
Enzyme
Mol. Mass.:
98316.97
Organism:
Homo sapiens (Human)
Description:
P30530
Residue:
894
  
Inhibitor
Name:
BDBM50445473
Synonyms:
CHEMBL3104851
Type:
Small organic molecule
Emp. Form.:
C18H14O9
Mol. Mass.:
374.2984
SMILES:
Cc1c(O)c(O)c2O[C@H]3O[C@H](C(=O)c4c(O)c(O)c(O)c(C)c34)c2c1C=O
: