Target
Aurora kinase B
Ligand
BDBM50445473
Substrate
Meas. Tech.
ChEMBL_1284305 (CHEMBL3108326)
IC50
2510±n/a nM
Citation
 El Amrani, MLai, DDebbab, AAly, AHSiems, KSeidel, CSchnekenburger, MGaigneaux, ADiederich, MFeger, DLin, WProksch, P Protein kinase and HDAC inhibitors from the endophytic fungus Epicoccum nigrum. J Nat Prod 77:49-56 (2014)  
Target
Name:
Aurora kinase B
Synonyms:
AIK2 AIM1 ARK2 AURKB_HUMAN Aurora B-INCENP Aurora kinase B (AURKB) STK-1 STK12 Serine/threonine-protein kinase aurora B
Type:
Protein
Mol. Mass.:
39327.72
Organism:
Homo sapiens (Human)
Description:
Q96GD4
Residue:
344
  
Inhibitor
Name:
BDBM50445473
Synonyms:
CHEMBL3104851
Type:
Small organic molecule
Emp. Form.:
C18H14O9
Mol. Mass.:
374.2984
SMILES:
Cc1c(O)c(O)c2O[C@H]3O[C@H](C(=O)c4c(O)c(O)c(O)c(C)c34)c2c1C=O
: