Target
ALK tyrosine kinase receptor
Ligand
BDBM50445475
Substrate
Meas. Tech.
ChEMBL_1284309 (CHEMBL3108330)
IC50
5020±n/a nM
Citation
 El Amrani, MLai, DDebbab, AAly, AHSiems, KSeidel, CSchnekenburger, MGaigneaux, ADiederich, MFeger, DLin, WProksch, P Protein kinase and HDAC inhibitors from the endophytic fungus Epicoccum nigrum. J Nat Prod 77:49-56 (2014)  
Target
Name:
ALK tyrosine kinase receptor
Synonyms:
ALK ALK_HUMAN CD_antigen: CD246
Type:
Protein
Mol. Mass.:
176453.10
Organism:
Homo sapiens (Human)
Description:
Q9UM73
Residue:
1620
  
Inhibitor
Name:
BDBM50445475
Synonyms:
CHEMBL3104854
Type:
Small organic molecule
Emp. Form.:
C9H8O5
Mol. Mass.:
196.1568
SMILES:
Cc1c2COC(=O)c2c(O)c(O)c1O
: